Reaction Details
TargetCannabinoid receptor 1
LigandBDBM50389931
Substrate/Competitorn/a
Meas. Tech.ChEMBL_1502796 (CHEMBL3591199)
EC50 4580±n/a nM
Citation Cawston, EEConnor, MDi Marzo, VSilvestri, RGlass, M Distinct Temporal Fingerprint for Cyclic Adenosine Monophosphate (cAMP) Signaling of Indole-2-carboxamides as Allosteric Modulators of the Cannabinoid Receptors. J Med Chem58:5979-88 (2015) 
 
Cannabinoid receptor 1
Name:Cannabinoid receptor 1
Type:G Protein-Coupled Receptor (GPCR)
Mol. Mass.:52868.96
Organism:Homo sapiens (Human)
Description:P21554
Residue:472
BDBM50389931
NameBDBM50389931
Synonyms:CHEMBL2071066
TypeSmall organic molecule
Emp. Form.C19H18ClFN2O
Mol. Mass.344.81
SMILESCCc1c([nH]c2ccc(Cl)cc12)C(=O)NCCc1ccc(F)cc1