Reaction Details
TargetCannabinoid receptor 1
LigandBDBM50389934
Substrate/Competitorn/a
Meas. Tech.ChEMBL_1502794 (CHEMBL3591197)
EC50 4010±n/a nM
Citation Cawston, EEConnor, MDi Marzo, VSilvestri, RGlass, M Distinct Temporal Fingerprint for Cyclic Adenosine Monophosphate (cAMP) Signaling of Indole-2-carboxamides as Allosteric Modulators of the Cannabinoid Receptors. J Med Chem58:5979-88 (2015) 
 
Cannabinoid receptor 1
Name:Cannabinoid receptor 1
Type:G Protein-Coupled Receptor (GPCR)
Mol. Mass.:52868.96
Organism:Homo sapiens (Human)
Description:P21554
Residue:472
BDBM50389934
NameBDBM50389934
Synonyms:CHEMBL2071070
TypeSmall organic molecule
Emp. Form.C24H29N3O
Mol. Mass.375.5066
SMILESCCc1c([nH]c2ccccc12)C(=O)NCCc1ccc(cc1)N1CCCCC1