Reaction Details
TargetCannabinoid receptor 1
LigandBDBM50389932
Substrate/Competitorn/a
Meas. Tech.ChEMBL_1502794 (CHEMBL3591197)
EC50 2660±n/a nM
Citation Cawston, EEConnor, MDi Marzo, VSilvestri, RGlass, M Distinct Temporal Fingerprint for Cyclic Adenosine Monophosphate (cAMP) Signaling of Indole-2-carboxamides as Allosteric Modulators of the Cannabinoid Receptors. J Med Chem58:5979-88 (2015) 
 
Cannabinoid receptor 1
Name:Cannabinoid receptor 1
Type:G Protein-Coupled Receptor (GPCR)
Mol. Mass.:52868.96
Organism:Homo sapiens (Human)
Description:P21554
Residue:472
BDBM50389932
NameBDBM50389932
Synonyms:CHEMBL2071068
TypeSmall organic molecule
Emp. Form.C24H28ClN3O2
Mol. Mass.425.951
SMILESCC(O)c1c([nH]c2ccc(Cl)cc12)C(=O)NCCc1ccc(cc1)N1CCCCC1