Reaction Details
TargetTyrosine-protein kinase JAK2
LigandBDBM50095953
Substrate/Competitorn/a
Meas. Tech.ChEMBL_1505205 (CHEMBL3594790)
IC50 12±n/a nM
Citation Nakajima, YInoue, TNakai, KMukoyoshi, KHamaguchi, HHatanaka, KSasaki, HTanaka, ATakahashi, FKunikawa, SUsuda, HMoritomo, AHigashi, YInami, MShirakami, S Synthesis and evaluation of novel 1H-pyrrolo[2,3-b]pyridine-5-carboxamide derivatives as potent and orally efficacious immunomodulators targeting JAK3. Bioorg Med Chem23:4871-83 (2015) 
 
Tyrosine-protein kinase JAK2
Name:Tyrosine-protein kinase JAK2
Type:Protein
Mol. Mass.:130684.68
Organism:Homo sapiens (Human)
Description:O60674
Residue:1132
BDBM50095953
NameBDBM50095953
Synonyms:CHEMBL3593776
TypeSmall organic molecule
Emp. Form.C18H18N8O
Mol. Mass.362.3885
SMILESNC(=O)c1cnc2[nH]ccc2c1NC1CCN(CC1)c1ccc(nn1)C#N