Reaction Details
TargetTyrosine-protein kinase JAK2
LigandBDBM50095958
Substrate/Competitorn/a
Meas. Tech.ChEMBL_1505205 (CHEMBL3594790)
IC50 370±n/a nM
Citation Nakajima, YInoue, TNakai, KMukoyoshi, KHamaguchi, HHatanaka, KSasaki, HTanaka, ATakahashi, FKunikawa, SUsuda, HMoritomo, AHigashi, YInami, MShirakami, S Synthesis and evaluation of novel 1H-pyrrolo[2,3-b]pyridine-5-carboxamide derivatives as potent and orally efficacious immunomodulators targeting JAK3. Bioorg Med Chem23:4871-83 (2015) 
 
Tyrosine-protein kinase JAK2
Name:Tyrosine-protein kinase JAK2
Type:Protein
Mol. Mass.:130684.68
Organism:Homo sapiens (Human)
Description:O60674
Residue:1132
BDBM50095958
NameBDBM50095958
Synonyms:CHEMBL3593772
TypeSmall organic molecule
Emp. Form.C19H19F3N6O
Mol. Mass.404.389
SMILESNC(=O)c1cnc2[nH]ccc2c1NC1CCN(CC1)c1ccc(cn1)C(F)(F)F