Reaction Details
TargetTyrosine-protein kinase JAK1
LigandBDBM50095964
Substrate/Competitorn/a
Meas. Tech.ChEMBL_1505206 (CHEMBL3594791)
IC50 84±n/a nM
Citation Nakajima, YInoue, TNakai, KMukoyoshi, KHamaguchi, HHatanaka, KSasaki, HTanaka, ATakahashi, FKunikawa, SUsuda, HMoritomo, AHigashi, YInami, MShirakami, S Synthesis and evaluation of novel 1H-pyrrolo[2,3-b]pyridine-5-carboxamide derivatives as potent and orally efficacious immunomodulators targeting JAK3. Bioorg Med Chem23:4871-83 (2015) 
 
Tyrosine-protein kinase JAK1
Name:Tyrosine-protein kinase JAK1
Type:Protein
Mol. Mass.:133293.73
Organism:Homo sapiens (Human)
Description:P23458
Residue:1154
BDBM50095964
NameBDBM50095964
Synonyms:CHEMBL3593765
TypeSmall organic molecule
Emp. Form.C20H23N5O
Mol. Mass.349.4295
SMILESNC(=O)c1cnc2[nH]ccc2c1NC1CCN(Cc2ccccc2)CC1