Reaction Details
TargetTyrosine-protein kinase JAK3
LigandBDBM50095957
Substrate/Competitorn/a
Meas. Tech.ChEMBL_1505207 (CHEMBL3594792)
IC50 5.2±n/a nM
Citation Nakajima, YInoue, TNakai, KMukoyoshi, KHamaguchi, HHatanaka, KSasaki, HTanaka, ATakahashi, FKunikawa, SUsuda, HMoritomo, AHigashi, YInami, MShirakami, S Synthesis and evaluation of novel 1H-pyrrolo[2,3-b]pyridine-5-carboxamide derivatives as potent and orally efficacious immunomodulators targeting JAK3. Bioorg Med Chem23:4871-83 (2015) 
 
Tyrosine-protein kinase JAK3
Name:Tyrosine-protein kinase JAK3
Type:Protein
Mol. Mass.:125111.08
Organism:Homo sapiens (Human)
Description:P52333
Residue:1124
BDBM50095957
NameBDBM50095957
Synonyms:CHEMBL3593773
TypeSmall organic molecule
Emp. Form.C19H21N7O2
Mol. Mass.379.4157
SMILESNC(=O)c1ccc(nc1)N1CCC(CC1)Nc1c(cnc2[nH]ccc12)C(N)=O