Reaction Details
TargetTyrosine-protein kinase ITK/TSK
LigandBDBM50095952
Substrate/Competitorn/a
Meas. Tech.ChEMBL_1505251 (CHEMBL3594876)
IC50>1000±n/a nM
Citation Nakajima, YInoue, TNakai, KMukoyoshi, KHamaguchi, HHatanaka, KSasaki, HTanaka, ATakahashi, FKunikawa, SUsuda, HMoritomo, AHigashi, YInami, MShirakami, S Synthesis and evaluation of novel 1H-pyrrolo[2,3-b]pyridine-5-carboxamide derivatives as potent and orally efficacious immunomodulators targeting JAK3. Bioorg Med Chem23:4871-83 (2015) 
 
Tyrosine-protein kinase ITK/TSK
Name:Tyrosine-protein kinase ITK/TSK
Type:Protein
Mol. Mass.:71839.20
Organism:Homo sapiens (Human)
Description:Q08881
Residue:620
BDBM50095952
NameBDBM50095952
Synonyms:CHEMBL3593777
TypeSmall organic molecule
Emp. Form.C19H18FN7O
Mol. Mass.379.3909
SMILESNC(=O)c1cnc2[nH]ccc2c1N[C@@H]1CCN(C[C@@H]1F)c1ccc(cn1)C#N