Reaction Details
TargetAurora kinase A
LigandBDBM50096114
Substrate/Competitorn/a
Meas. Tech.ChEMBL_1505365 (CHEMBL3595191)
IC50>10000±n/a nM
Citation Chen, CTHsu, JTLin, WHLu, CTYen, SCHsu, THuang, YLSong, JSChen, CHChou, LHYen, KJChen, CPKuo, PCHuang, CLLiu, HEChao, YSYeh, TKJiaang, WT Identification of a potent 5-phenyl-thiazol-2-ylamine-based inhibitor of FLT3 with activity against drug resistance-conferring point mutations. Eur J Med Chem100:151-61 (2015) 
 
Aurora kinase A
Name:Aurora kinase A
Type:Serine/threonine-protein kinase
Mol. Mass.:45830.98
Organism:Homo sapiens (Human)
Description:O14965
Residue:403
BDBM50096114
NameBDBM50096114
Synonyms:CHEMBL3593283
TypeSmall organic molecule
Emp. Form.C26H28N8OS
Mol. Mass.500.619
SMILESCN1CCN(CC1)c1cc(Nc2ncc(s2)-c2ccc(NC(=O)Nc3ccccc3)cc2)nc(C)n1