Reaction Details
TargetVascular endothelial growth factor receptor 2
LigandBDBM50096115
Substrate/Competitorn/a
Meas. Tech.ChEMBL_1505364 (CHEMBL3595190)
IC50 370±n/a nM
Citation Chen, CTHsu, JTLin, WHLu, CTYen, SCHsu, THuang, YLSong, JSChen, CHChou, LHYen, KJChen, CPKuo, PCHuang, CLLiu, HEChao, YSYeh, TKJiaang, WT Identification of a potent 5-phenyl-thiazol-2-ylamine-based inhibitor of FLT3 with activity against drug resistance-conferring point mutations. Eur J Med Chem100:151-61 (2015) 
 
Vascular endothelial growth factor receptor 2
Name:Vascular endothelial growth factor receptor 2
Type:Receptor Tyrosine Kinase
Mol. Mass.:151510.97
Organism:Homo sapiens (Human)
Description:P35968
Residue:1356
BDBM50096115
NameBDBM50096115
Synonyms:CHEMBL3593296
TypeSmall organic molecule
Emp. Form.C27H28N6O5S
Mol. Mass.548.613
SMILESCc1cc(NC(=O)Nc2ccc(cc2)-c2cnc(NC(=O)c3ccc(OCCN4CCOCC4)cc3)s2)no1