Reaction Details
TargetVascular endothelial growth factor receptor 2
LigandBDBM50096122
Substrate/Competitorn/a
Meas. Tech.ChEMBL_1505364 (CHEMBL3595190)
IC50 10.0±n/a nM
Citation Chen, CTHsu, JTLin, WHLu, CTYen, SCHsu, THuang, YLSong, JSChen, CHChou, LHYen, KJChen, CPKuo, PCHuang, CLLiu, HEChao, YSYeh, TKJiaang, WT Identification of a potent 5-phenyl-thiazol-2-ylamine-based inhibitor of FLT3 with activity against drug resistance-conferring point mutations. Eur J Med Chem100:151-61 (2015) 
 
Vascular endothelial growth factor receptor 2
Name:Vascular endothelial growth factor receptor 2
Type:Receptor Tyrosine Kinase
Mol. Mass.:151510.97
Organism:Homo sapiens (Human)
Description:P35968
Residue:1356
BDBM50096122
NameBDBM50096122
Synonyms:CHEMBL3593288
TypeSmall organic molecule
Emp. Form.C25H29N9O2S
Mol. Mass.519.622
SMILESCCc1cc(NC(=O)Nc2ccc(cc2)-c2cnc(Nc3cc(nc(C)n3)N3CCN(C)CC3)s2)no1