Reaction Details
TargetVascular endothelial growth factor receptor 2
LigandBDBM50095992
Substrate/Competitorn/a
Meas. Tech.ChEMBL_1505364 (CHEMBL3595190)
IC50 53±n/a nM
Citation Chen, CTHsu, JTLin, WHLu, CTYen, SCHsu, THuang, YLSong, JSChen, CHChou, LHYen, KJChen, CPKuo, PCHuang, CLLiu, HEChao, YSYeh, TKJiaang, WT Identification of a potent 5-phenyl-thiazol-2-ylamine-based inhibitor of FLT3 with activity against drug resistance-conferring point mutations. Eur J Med Chem100:151-61 (2015) 
 
Vascular endothelial growth factor receptor 2
Name:Vascular endothelial growth factor receptor 2
Type:Receptor Tyrosine Kinase
Mol. Mass.:151510.97
Organism:Homo sapiens (Human)
Description:P35968
Residue:1356
BDBM50095992
NameBDBM50095992
Synonyms:CHEMBL3593284
TypeSmall organic molecule
Emp. Form.C26H28N8OS
Mol. Mass.500.619
SMILESCc1nc(Nc2ncc(s2)-c2ccc(NC(=O)Nc3ccccc3)cc2)cc(n1)N1CCC(N)CC1