Reaction Details
TargetAurora kinase A
LigandBDBM50096121
Substrate/Competitorn/a
Meas. Tech.ChEMBL_1505365 (CHEMBL3595191)
IC50 38±n/a nM
Citation Chen, CTHsu, JTLin, WHLu, CTYen, SCHsu, THuang, YLSong, JSChen, CHChou, LHYen, KJChen, CPKuo, PCHuang, CLLiu, HEChao, YSYeh, TKJiaang, WT Identification of a potent 5-phenyl-thiazol-2-ylamine-based inhibitor of FLT3 with activity against drug resistance-conferring point mutations. Eur J Med Chem100:151-61 (2015) 
 
Aurora kinase A
Name:Aurora kinase A
Type:Serine/threonine-protein kinase
Mol. Mass.:45830.98
Organism:Homo sapiens (Human)
Description:O14965
Residue:403
BDBM50096121
NameBDBM50096121
Synonyms:CHEMBL3593289
TypeSmall organic molecule
Emp. Form.C27H33N9O2S
Mol. Mass.547.675
SMILESCCCCc1cc(NC(=O)Nc2ccc(cc2)-c2cnc(Nc3cc(nc(C)n3)N3CCN(C)CC3)s2)no1