Reaction Details
TargetCarbonic anhydrase 1
LigandBDBM50132133
Substrate/Competitorn/a
Meas. Tech.ChEMBL_1505685 (CHEMBL3594605)
Ki>50000±n/a nM
Citation Cvijetic, INTanç, MJuranic, IOVerbic, T?Supuran, CTDrakulic, BJ 5-Aryl-1H-pyrazole-3-carboxylic acids as selective inhibitors of human carbonic anhydrases IX and XII. Bioorg Med Chem23:4649-59 (2015) 
 
Carbonic anhydrase 1
Name:Carbonic anhydrase 1
Type:Enzyme
Mol. Mass.:28873.37
Organism:Homo sapiens (Human)
Description:P00915
Residue:261
BDBM50132133
NameBDBM50132133
Synonyms:5-p-Tolyl-1H-pyrazole-3-carboxylic acid cid_818267
TypeSmall organic molecule
Emp. Form.C11H10N2O2
Mol. Mass.202.2093
SMILESCc1ccc(cc1)-c1cc([nH]n1)C(O)=O