Reaction Details
TargetCarbonic anhydrase 2
LigandBDBM50096138
Substrate/Competitorn/a
Meas. Tech.ChEMBL_1505686 (CHEMBL3594606)
Ki>50000±n/a nM
Citation Cvijetic, INTanç, MJuranic, IOVerbic, T?Supuran, CTDrakulic, BJ 5-Aryl-1H-pyrazole-3-carboxylic acids as selective inhibitors of human carbonic anhydrases IX and XII. Bioorg Med Chem23:4649-59 (2015) 
 
Carbonic anhydrase 2
Name:Carbonic anhydrase 2
Type:Enzyme
Mol. Mass.:29250.71
Organism:Homo sapiens (Human)
Description:P00918
Residue:260
BDBM50096138
NameBDBM50096138
Synonyms:CHEMBL3593608
TypeSmall organic molecule
Emp. Form.C16H20N2O2
Mol. Mass.272.3422
SMILESCCc1cc(CC)c(-c2cc(n[nH]2)C(O)=O)c(CC)c1