Reaction Details
TargetCarbonic anhydrase 9
LigandBDBM50096141
Substrate/Competitorn/a
Meas. Tech.ChEMBL_1505687 (CHEMBL3594607)
Ki 5000±n/a nM
Citation Cvijetic, INTanç, MJuranic, IOVerbic, T?Supuran, CTDrakulic, BJ 5-Aryl-1H-pyrazole-3-carboxylic acids as selective inhibitors of human carbonic anhydrases IX and XII. Bioorg Med Chem23:4649-59 (2015) 
 
Carbonic anhydrase 9
Name:Carbonic anhydrase 9
Type:Enzyme
Mol. Mass.:49669.03
Organism:Homo sapiens (Human)
Description:Catalytic domain of human cloned isozyme was used in the assay
Residue:459
BDBM50096141
NameBDBM50096141
Synonyms:CHEMBL3593605
TypeSmall organic molecule
Emp. Form.C14H16N2O2
Mol. Mass.244.289
SMILESCC(C)(C)c1ccc(cc1)-c1cc(n[nH]1)C(O)=O