Reaction Details
TargetCarbonic anhydrase 9
LigandBDBM50096132
Substrate/Competitorn/a
Meas. Tech.ChEMBL_1505687 (CHEMBL3594607)
Ki>50000±n/a nM
Citation Cvijetic, INTanç, MJuranic, IOVerbic, T?Supuran, CTDrakulic, BJ 5-Aryl-1H-pyrazole-3-carboxylic acids as selective inhibitors of human carbonic anhydrases IX and XII. Bioorg Med Chem23:4649-59 (2015) 
 
Carbonic anhydrase 9
Name:Carbonic anhydrase 9
Type:Enzyme
Mol. Mass.:49669.03
Organism:Homo sapiens (Human)
Description:Catalytic domain of human cloned isozyme was used in the assay
Residue:459
BDBM50096132
NameBDBM50096132
Synonyms:CHEMBL3593613
TypeSmall organic molecule
Emp. Form.C14H15N3O2
Mol. Mass.257.2878
SMILESOC(=O)c1cc([nH]n1)-c1ccc(cc1)N1CCCC1