Reaction Details
TargetCarbonic anhydrase 12
LigandBDBM50132133
Substrate/Competitorn/a
Meas. Tech.ChEMBL_1505688 (CHEMBL3594608)
Ki>50000±n/a nM
Citation Cvijetic, INTanç, MJuranic, IOVerbic, T?Supuran, CTDrakulic, BJ 5-Aryl-1H-pyrazole-3-carboxylic acids as selective inhibitors of human carbonic anhydrases IX and XII. Bioorg Med Chem23:4649-59 (2015) 
 
Carbonic anhydrase 12
Name:Carbonic anhydrase 12
Type:Enzyme
Mol. Mass.:39456.00
Organism:Homo sapiens (Human)
Description:Catalytic domain of human cloned isozyme was used in the assay
Residue:354
BDBM50132133
NameBDBM50132133
Synonyms:5-p-Tolyl-1H-pyrazole-3-carboxylic acid cid_818267
TypeSmall organic molecule
Emp. Form.C11H10N2O2
Mol. Mass.202.2093
SMILESCc1ccc(cc1)-c1cc([nH]n1)C(O)=O