Reaction Details
TargetDihydroorotate dehydrogenase (quinone), mitochondrial
LigandBDBM50300015
Substrate/Competitorn/a
Meas. Tech.ChEMBL_1505693 (CHEMBL3594613)
IC50 19000±n/a nM
Citation Abdullah, IChee, CFLee, YKThunuguntla, SSSatish Reddy, KNellore, KAntony, TVerma, JMun, KWOthman, SSubramanya, HRahman, NA Benzimidazole derivatives as potential dual inhibitors for PARP-1 and DHODH. Bioorg Med Chem23:4669-80 (2015) 
 
Dihydroorotate dehydrogenase (quinone), mitochondrial
Name:Dihydroorotate dehydrogenase (quinone), mitochondrial
Type:Enzyme
Mol. Mass.:42881.33
Organism:Homo sapiens (Human)
Description:Q02127
Residue:395
BDBM50300015
NameBDBM50300015
Synonyms:2-(4-(Pyridin-3-yl)phenyl)-1H-benzo[d]imidazole-4-carboxamide CHEMBL571285
TypeSmall organic molecule
Emp. Form.C19H14N4O
Mol. Mass.314.3407
SMILESNC(=O)c1cccc2[nH]c(nc12)-c1ccc(cc1)-c1cccnc1