Reaction Details
TargetSerine/threonine-protein kinase PAK 1
LigandBDBM50096235
Substrate/Competitorn/a
Meas. Tech.ChEMBL_1505869 (CHEMBL3595326)
Ki 373±n/a nM
Citation Rudolph, JAliagas, ICrawford, JJMathieu, SLee, WChao, QDong, PRouge, LWang, WHeise, CMurray, LJLa, HLiu, YManning, GDiederich, FHoeflich, KP Leveraging the Pre-DFG Residue Thr-406 To Obtain High Kinase Selectivity in an Aminopyrazole-Type PAK1 Inhibitor Series. ACS Med Chem Lett6:711-5 (2015) 
 
Serine/threonine-protein kinase PAK 1
Name:Serine/threonine-protein kinase PAK 1
Type:n/a
Mol. Mass.:60640.15
Organism:Homo sapiens (Human)
Description:Q13153
Residue:545
BDBM50096235
NameBDBM50096235
Synonyms:CHEMBL3594173
TypeSmall organic molecule
Emp. Form.C20H22ClN9O
Mol. Mass.439.901
SMILESCN(Cc1cc(Nc2ccnc(n2)N(C)Cc2ccc3[nH]cnc3c2Cl)n[nH]1)C(C)=O