Reaction Details
TargetSerine/threonine-protein kinase PAK 4
LigandBDBM50096228
Substrate/Competitorn/a
Meas. Tech.ChEMBL_1505870 (CHEMBL3595327)
Ki 950±n/a nM
Citation Rudolph, JAliagas, ICrawford, JJMathieu, SLee, WChao, QDong, PRouge, LWang, WHeise, CMurray, LJLa, HLiu, YManning, GDiederich, FHoeflich, KP Leveraging the Pre-DFG Residue Thr-406 To Obtain High Kinase Selectivity in an Aminopyrazole-Type PAK1 Inhibitor Series. ACS Med Chem Lett6:711-5 (2015) 
 
Serine/threonine-protein kinase PAK 4
Name:Serine/threonine-protein kinase PAK 4
Type:Protein
Mol. Mass.:64098.01
Organism:Homo sapiens (Human)
Description:O96013
Residue:591
BDBM50096228
NameBDBM50096228
Synonyms:CHEMBL3594175
TypeSmall organic molecule
Emp. Form.C21H22ClN9O
Mol. Mass.451.912
SMILESCN(Cc1ccc2[nH]cnc2c1Cl)c1nccc(Nc2cc([nH]n2)[C@H]2CCN(C)C2=O)n1