Reaction Details
TargetSerine/threonine-protein kinase PAK 4
LigandBDBM50096230
Substrate/Competitorn/a
Meas. Tech.ChEMBL_1505870 (CHEMBL3595327)
Ki 621±n/a nM
Citation Rudolph, JAliagas, ICrawford, JJMathieu, SLee, WChao, QDong, PRouge, LWang, WHeise, CMurray, LJLa, HLiu, YManning, GDiederich, FHoeflich, KP Leveraging the Pre-DFG Residue Thr-406 To Obtain High Kinase Selectivity in an Aminopyrazole-Type PAK1 Inhibitor Series. ACS Med Chem Lett6:711-5 (2015) 
 
Serine/threonine-protein kinase PAK 4
Name:Serine/threonine-protein kinase PAK 4
Type:Protein
Mol. Mass.:64098.01
Organism:Homo sapiens (Human)
Description:O96013
Residue:591
BDBM50096230
NameBDBM50096230
Synonyms:CHEMBL3594178
TypeSmall organic molecule
Emp. Form.C21H32N8O
Mol. Mass.412.5318
SMILESCCN(C[C@H]1CC[C@H](N)CC1)c1nccc(Nc2cc([nH]n2)[C@H]2CCN(C)C2=O)n1