Reaction Details
TargetAurora kinase A
LigandBDBM50096236
Substrate/Competitorn/a
Meas. Tech.ChEMBL_1505871 (CHEMBL3595328)
Ki>5400±n/a nM
Citation Rudolph, JAliagas, ICrawford, JJMathieu, SLee, WChao, QDong, PRouge, LWang, WHeise, CMurray, LJLa, HLiu, YManning, GDiederich, FHoeflich, KP Leveraging the Pre-DFG Residue Thr-406 To Obtain High Kinase Selectivity in an Aminopyrazole-Type PAK1 Inhibitor Series. ACS Med Chem Lett6:711-5 (2015) 
 
Aurora kinase A
Name:Aurora kinase A
Type:Serine/threonine-protein kinase
Mol. Mass.:45830.98
Organism:Homo sapiens (Human)
Description:O14965
Residue:403
BDBM50096236
NameBDBM50096236
Synonyms:CHEMBL3594174
TypeSmall organic molecule
Emp. Form.C21H22ClN9O
Mol. Mass.451.912
SMILESCN(Cc1ccc2[nH]cnc2c1Cl)c1nccc(Nc2cc([nH]n2)[C@@H]2CCN(C)C2=O)n1