Reaction Details
TargetAurora kinase A
LigandBDBM50096240
Substrate/Competitorn/a
Meas. Tech.ChEMBL_1505871 (CHEMBL3595328)
Ki>5400±n/a nM
Citation Rudolph, JAliagas, ICrawford, JJMathieu, SLee, WChao, QDong, PRouge, LWang, WHeise, CMurray, LJLa, HLiu, YManning, GDiederich, FHoeflich, KP Leveraging the Pre-DFG Residue Thr-406 To Obtain High Kinase Selectivity in an Aminopyrazole-Type PAK1 Inhibitor Series. ACS Med Chem Lett6:711-5 (2015) 
 
Aurora kinase A
Name:Aurora kinase A
Type:Serine/threonine-protein kinase
Mol. Mass.:45830.98
Organism:Homo sapiens (Human)
Description:O14965
Residue:403
BDBM50096240
NameBDBM50096240
Synonyms:CHEMBL3594181
TypeSmall organic molecule
Emp. Form.C21H32N8O
Mol. Mass.412.5318
SMILESC[C@H]1CN(C)C(=O)[C@@H]1c1cc(Nc2ccnc(n2)N(C)C[C@H]2CC[C@H](N)CC2)n[nH]1