Reaction Details
TargetAurora kinase A
LigandBDBM50096241
Substrate/Competitorn/a
Meas. Tech.ChEMBL_1505871 (CHEMBL3595328)
Ki>5400±n/a nM
Citation Rudolph, JAliagas, ICrawford, JJMathieu, SLee, WChao, QDong, PRouge, LWang, WHeise, CMurray, LJLa, HLiu, YManning, GDiederich, FHoeflich, KP Leveraging the Pre-DFG Residue Thr-406 To Obtain High Kinase Selectivity in an Aminopyrazole-Type PAK1 Inhibitor Series. ACS Med Chem Lett6:711-5 (2015) 
 
Aurora kinase A
Name:Aurora kinase A
Type:Serine/threonine-protein kinase
Mol. Mass.:45830.98
Organism:Homo sapiens (Human)
Description:O14965
Residue:403
BDBM50096241
NameBDBM50096241
Synonyms:CHEMBL3594182
TypeSmall organic molecule
Emp. Form.C22H34N8O
Mol. Mass.426.5584
SMILESCN(C[C@H]1CC[C@H](N)CC1)c1nccc(Nc2cc([nH]n2)C2C(=O)N(C)CC2(C)C)n1