Reaction Details
TargetRAF proto-oncogene serine/threonine-protein kinase
LigandBDBM50096329
Substrate/Competitorn/a
Meas. Tech.ChEMBL_1495599 (CHEMBL3578337)
IC50 6.7±n/a nM
Citation Henry, JRKaufman, MDPeng, SBAhn, YMCaldwell, TMVogeti, LTelikepalli, HLu, WPHood, MMRutkoski, TJSmith, BDVogeti, SMiller, DWise, SCChun, LZhang, XZhang, YKays, LHipskind, PAWrobleski, ADLobb, KLClay, JMCohen, JDWalgren, JLMcCann, DPatel, PClawson, DKGuo, SManglicmot, DGroshong, CLogan, CStarling, JJFlynn, DL Discovery of 1-(3,3-dimethylbutyl)-3-(2-fluoro-4-methyl-5-(7-methyl-2-(methylamino)pyrido[2,3-d]pyrimidin-6-yl)phenyl)urea (LY3009120) as a pan-RAF inhibitor with minimal paradoxical activation and activity against BRAF or RAS mutant tumor cells. J Med Chem58:4165-79 (2015) 
 
RAF proto-oncogene serine/threonine-protein kinase
Name:RAF proto-oncogene serine/threonine-protein kinase
Type:Serine/threonine-protein kinase
Mol. Mass.:73082.52
Organism:Homo sapiens (Human)
Description:P04049
Residue:648
BDBM50096329
NameBDBM50096329
Synonyms:CHEMBL3577118
TypeSmall organic molecule
Emp. Form.C24H31N5O
Mol. Mass.405.5358
SMILESCNc1cc2nc(C)c(cc2cn1)-c1cc(NC(=O)NCCC(C)(C)C)ccc1C