Reaction Details
TargetNitric oxide synthase, inducible
LigandBDBM50096338
Substrate/Competitorn/a
Meas. Tech.ChEMBL_1495907 (CHEMBL3579718)
IC50 29±n/a nM
Citation Li, WZheng, SHiggins, MMorra, RPMendis, ATChien, CWOjima, IMierke, DFDinkova-Kostova, ATHonda, T New Monocyclic, Bicyclic, and Tricyclic Ethynylcyanodienones as Activators of the Keap1/Nrf2/ARE Pathway and Inhibitors of Inducible Nitric Oxide Synthase. J Med Chem58:4738-48 (2015) 
 
Nitric oxide synthase, inducible
Name:Nitric oxide synthase, inducible
Type:Enzyme
Mol. Mass.:130595.79
Organism:Mus musculus (mouse)
Description:Recombinant enzyme overexpressed in E. coli.
Residue:1144
BDBM50096338
NameBDBM50096338
Synonyms:CHEMBL3577127
TypeSmall organic molecule
Emp. Form.C11H9NO
Mol. Mass.171.1953
SMILESCCC1(C=CC(=O)C(=C1)C#N)C#C