Reaction Details
TargetPutative P2Y purinoceptor 10
LigandBDBM50096352
Substrate/Competitorn/a
Meas. Tech.ChEMBL_1495909 (CHEMBL3579720)
EC50 86±n/a nM
Citation Ikubo, MInoue, ANakamura, SJung, SSayama, MOtani, YUwamizu, ASuzuki, KKishi, TShuto, AIshiguro, JOkudaira, MKano, KMakide, KAoki, JOhwada, T Structure-activity relationships of lysophosphatidylserine analogs as agonists of G-protein-coupled receptors GPR34, P2Y10, and GPR174. J Med Chem58:4204-19 (2015) 
 
Putative P2Y purinoceptor 10
Name:Putative P2Y purinoceptor 10
Type:PROTEIN
Mol. Mass.:38793.96
Organism:Homo sapiens (Human)
Description:ChEMBL_109762
Residue:339
BDBM50096352
NameBDBM50096352
Synonyms:CHEMBL3577144
TypeSmall organic molecule
Emp. Form.C22H42NO9P
Mol. Mass.495.5439
SMILESCCCCCC\C=C/CCCCCCCC(=O)OC[C@@H](O)COP(O)(=O)OC[C@H](N)C(O)=O