Reaction Details
TargetPutative P2Y purinoceptor 10
LigandBDBM50096440
Substrate/Competitorn/a
Meas. Tech.ChEMBL_1495909 (CHEMBL3579720)
EC50 460±n/a nM
Citation Ikubo, MInoue, ANakamura, SJung, SSayama, MOtani, YUwamizu, ASuzuki, KKishi, TShuto, AIshiguro, JOkudaira, MKano, KMakide, KAoki, JOhwada, T Structure-activity relationships of lysophosphatidylserine analogs as agonists of G-protein-coupled receptors GPR34, P2Y10, and GPR174. J Med Chem58:4204-19 (2015) 
 
Putative P2Y purinoceptor 10
Name:Putative P2Y purinoceptor 10
Type:PROTEIN
Mol. Mass.:38793.96
Organism:Homo sapiens (Human)
Description:ChEMBL_109762
Residue:339
BDBM50096440
NameBDBM50096440
Synonyms:CHEMBL3577169
TypeSmall organic molecule
Emp. Form.C22H36NO10P
Mol. Mass.505.4957
SMILESCCCCCCCOc1ccc(CCC(=O)OC[C@@H](O)COP(O)(=O)OC[C@H](N)C(O)=O)cc1