Reaction Details
TargetBeta sliding clamp
LigandBDBM50096609
Substrate/Competitorn/a
Meas. Tech.ChEMBL_1495912 (CHEMBL3579723)
IC50 115000±n/a nM
Citation Yin, ZWhittell, LRWang, YJergic, SMa, CLewis, PJDixon, NEBeck, JLKelso, MJOakley, AJ Bacterial Sliding Clamp Inhibitors that Mimic the Sequential Binding Mechanism of Endogenous Linear Motifs. J Med Chem58:4693-702 (2015) 
 
Beta sliding clamp
Name:Beta sliding clamp
Type:PROTEIN
Mol. Mass.:40578.60
Organism:Escherichia coli (strain K12)
Description:ChEMBL_109765
Residue:366
BDBM50096609
NameBDBM50096609
Synonyms:CHEMBL3577287
TypeSmall organic molecule
Emp. Form.C26H34BrN3O7
Mol. Mass.580.468
SMILESCC(C)(C)OC(=O)NCCCC[C@@H](NC(=O)Cn1c2C[C@@H](CCc2c2cc(Br)ccc12)C(O)=O)C(O)=O