Reaction Details
TargetBeta sliding clamp
LigandBDBM50096618
Substrate/Competitorn/a
Meas. Tech.ChEMBL_1495912 (CHEMBL3579723)
IC50 246000±n/a nM
Citation Yin, ZWhittell, LRWang, YJergic, SMa, CLewis, PJDixon, NEBeck, JLKelso, MJOakley, AJ Bacterial Sliding Clamp Inhibitors that Mimic the Sequential Binding Mechanism of Endogenous Linear Motifs. J Med Chem58:4693-702 (2015) 
 
Beta sliding clamp
Name:Beta sliding clamp
Type:PROTEIN
Mol. Mass.:40578.60
Organism:Escherichia coli (strain K12)
Description:ChEMBL_109765
Residue:366
BDBM50096618
NameBDBM50096618
Synonyms:CHEMBL3577276
TypeSmall organic molecule
Emp. Form.C15H15BrN2O3
Mol. Mass.351.195
SMILESNC(=O)Cn1c2C[C@@H](CCc2c2cc(Br)ccc12)C(O)=O