Reaction Details
TargetBeta sliding clamp
LigandBDBM50096638
Substrate/Competitorn/a
Meas. Tech.ChEMBL_1495912 (CHEMBL3579723)
IC50 134000±n/a nM
Citation Yin, ZWhittell, LRWang, YJergic, SMa, CLewis, PJDixon, NEBeck, JLKelso, MJOakley, AJ Bacterial Sliding Clamp Inhibitors that Mimic the Sequential Binding Mechanism of Endogenous Linear Motifs. J Med Chem58:4693-702 (2015) 
 
Beta sliding clamp
Name:Beta sliding clamp
Type:PROTEIN
Mol. Mass.:40578.60
Organism:Escherichia coli (strain K12)
Description:ChEMBL_109765
Residue:366
BDBM50096638
NameBDBM50096638
Synonyms:CHEMBL3577268
TypeSmall organic molecule
Emp. Form.C13H12ClNO2
Mol. Mass.249.693
SMILESOC(=O)[C@@H]1CCc2c(C1)[nH]c1ccc(Cl)cc21