Reaction Details
TargetMelatonin receptor type 1B
LigandBDBM50096967
Substrate/Competitorn/a
Meas. Tech.ChEMBL_1499385 (CHEMBL3583714)
Ki 190±n/a nM
Citation de la Fuente Revenga, MFernández-Sáez, NHerrera-Arozamena, CMorales-García, JAAlonso-Gil, SPérez-Castillo, ACaignard, DHRivara, SRodríguez-Franco, MI Novel N-Acetyl Bioisosteres of Melatonin: Melatonergic Receptor Pharmacology, Physicochemical Studies, and Phenotypic Assessment of Their Neurogenic Potential. J Med Chem58:4998-5014 (2015) 
 
Melatonin receptor type 1B
Name:Melatonin receptor type 1B
Type:Enzyme
Mol. Mass.:40203.54
Organism:Homo sapiens (Human)
Description:P49286
Residue:362
BDBM50096967
NameBDBM50096967
Synonyms:CHEMBL3580916
TypeSmall organic molecule
Emp. Form.C14H15N3O2
Mol. Mass.257.2878
SMILESCOc1ccc2[nH]cc(CCc3nnc(C)o3)c2c1