Reaction Details
TargetMelatonin receptor type 1B
LigandBDBM50097116
Substrate/Competitorn/a
Meas. Tech.ChEMBL_1499385 (CHEMBL3583714)
Ki 530±n/a nM
Citation de la Fuente Revenga, MFernández-Sáez, NHerrera-Arozamena, CMorales-García, JAAlonso-Gil, SPérez-Castillo, ACaignard, DHRivara, SRodríguez-Franco, MI Novel N-Acetyl Bioisosteres of Melatonin: Melatonergic Receptor Pharmacology, Physicochemical Studies, and Phenotypic Assessment of Their Neurogenic Potential. J Med Chem58:4998-5014 (2015) 
 
Melatonin receptor type 1B
Name:Melatonin receptor type 1B
Type:Enzyme
Mol. Mass.:40203.54
Organism:Homo sapiens (Human)
Description:P49286
Residue:362
BDBM50097116
NameBDBM50097116
Synonyms:CHEMBL3580921
TypeSmall organic molecule
Emp. Form.C13H13N3O2S
Mol. Mass.275.326
SMILESCOc1ccc2[nH]cc(CCc3n[nH]c(=S)o3)c2c1