Reaction Details
TargetMelatonin receptor type 1B
LigandBDBM50096971
Substrate/Competitorn/a
Meas. Tech.ChEMBL_1499385 (CHEMBL3583714)
Ki 17±n/a nM
Citation de la Fuente Revenga, MFernández-Sáez, NHerrera-Arozamena, CMorales-García, JAAlonso-Gil, SPérez-Castillo, ACaignard, DHRivara, SRodríguez-Franco, MI Novel N-Acetyl Bioisosteres of Melatonin: Melatonergic Receptor Pharmacology, Physicochemical Studies, and Phenotypic Assessment of Their Neurogenic Potential. J Med Chem58:4998-5014 (2015) 
 
Melatonin receptor type 1B
Name:Melatonin receptor type 1B
Type:Enzyme
Mol. Mass.:40203.54
Organism:Homo sapiens (Human)
Description:P49286
Residue:362
BDBM50096971
NameBDBM50096971
Synonyms:CHEMBL3580926
TypeSmall organic molecule
Emp. Form.C14H16N4OS
Mol. Mass.288.368
SMILESCCNc1nnc(Cc2c[nH]c3ccc(OC)cc23)s1