Reaction Details
TargetSerine/threonine-protein kinase PAK 1
LigandBDBM50097121
Substrate/Competitorn/a
Meas. Tech.ChEMBL_1499557 (CHEMBL3584415)
Ki 18±n/a nM
Citation Crawford, JJLee, WAliagas, IMathieu, SHoeflich, KPZhou, WWang, WRouge, LMurray, LLa, HLiu, NFan, PWCheong, JHeise, CERamaswamy, SMintzer, RLiu, YChao, QRudolph, J Structure-Guided Design of Group I Selective p21-Activated Kinase Inhibitors. J Med Chem58:5121-36 (2015) 
 
Serine/threonine-protein kinase PAK 1
Name:Serine/threonine-protein kinase PAK 1
Type:n/a
Mol. Mass.:60640.15
Organism:Homo sapiens (Human)
Description:Q13153
Residue:545
BDBM50097121
NameBDBM50097121
Synonyms:CHEMBL3580954
TypeSmall organic molecule
Emp. Form.C18H23N7S
Mol. Mass.369.487
SMILESNC1CCN(CC1)c1nc(Nc2cc([nH]n2)C2CCC2)c2sccc2n1