Reaction Details
TargetAurora kinase A
LigandBDBM50097128
Substrate/Competitorn/a
Meas. Tech.ChEMBL_1499588 (CHEMBL3584534)
Ki 5.3±n/a nM
Citation Crawford, JJLee, WAliagas, IMathieu, SHoeflich, KPZhou, WWang, WRouge, LMurray, LLa, HLiu, NFan, PWCheong, JHeise, CERamaswamy, SMintzer, RLiu, YChao, QRudolph, J Structure-Guided Design of Group I Selective p21-Activated Kinase Inhibitors. J Med Chem58:5121-36 (2015) 
 
Aurora kinase A
Name:Aurora kinase A
Type:Serine/threonine-protein kinase
Mol. Mass.:45830.98
Organism:Homo sapiens (Human)
Description:O14965
Residue:403
BDBM50097128
NameBDBM50097128
Synonyms:CHEMBL3580976
TypeSmall organic molecule
Emp. Form.C20H21ClN8
Mol. Mass.408.887
SMILESCCN(Cc1ccc2[nH]cnc2c1Cl)c1nccc(Nc2cc([nH]n2)C2CC2)n1