Reaction Details
TargetSerine/threonine-protein kinase PAK 4
LigandBDBM50097130
Substrate/Competitorn/a
Meas. Tech.ChEMBL_1499590 (CHEMBL3584536)
Ki 49±n/a nM
Citation Crawford, JJLee, WAliagas, IMathieu, SHoeflich, KPZhou, WWang, WRouge, LMurray, LLa, HLiu, NFan, PWCheong, JHeise, CERamaswamy, SMintzer, RLiu, YChao, QRudolph, J Structure-Guided Design of Group I Selective p21-Activated Kinase Inhibitors. J Med Chem58:5121-36 (2015) 
 
Serine/threonine-protein kinase PAK 4
Name:Serine/threonine-protein kinase PAK 4
Type:Protein
Mol. Mass.:64098.01
Organism:Homo sapiens (Human)
Description:O96013
Residue:591
BDBM50097130
NameBDBM50097130
Synonyms:CHEMBL3580948
TypeSmall organic molecule
Emp. Form.C20H24N6
Mol. Mass.348.4448
SMILESCC1CCN(CC1)c1nc(Nc2cc([nH]n2)C2CC2)c2ccccc2n1