Reaction Details
TargetSerine/threonine-protein kinase PAK 1
LigandBDBM50097133
Substrate/Competitorn/a
Meas. Tech.ChEMBL_1499560 (CHEMBL3584418)
IC50 120±n/a nM
Citation Crawford, JJLee, WAliagas, IMathieu, SHoeflich, KPZhou, WWang, WRouge, LMurray, LLa, HLiu, NFan, PWCheong, JHeise, CERamaswamy, SMintzer, RLiu, YChao, QRudolph, J Structure-Guided Design of Group I Selective p21-Activated Kinase Inhibitors. J Med Chem58:5121-36 (2015) 
 
Serine/threonine-protein kinase PAK 1
Name:Serine/threonine-protein kinase PAK 1
Type:n/a
Mol. Mass.:60640.15
Organism:Homo sapiens (Human)
Description:Q13153
Residue:545
BDBM50097133
NameBDBM50097133
Synonyms:CHEMBL3580968
TypeSmall organic molecule
Emp. Form.C20H21N7
Mol. Mass.359.4276
SMILESC[C@H](Nc1nccc(Nc2cc([nH]n2)C2CC2)n1)c1ccc2[nH]ccc2c1