Reaction Details
TargetSerine/threonine-protein kinase PAK 4
LigandBDBM50097137
Substrate/Competitorn/a
Meas. Tech.ChEMBL_1499558 (CHEMBL3584416)
Ki 1900±n/a nM
Citation Crawford, JJLee, WAliagas, IMathieu, SHoeflich, KPZhou, WWang, WRouge, LMurray, LLa, HLiu, NFan, PWCheong, JHeise, CERamaswamy, SMintzer, RLiu, YChao, QRudolph, J Structure-Guided Design of Group I Selective p21-Activated Kinase Inhibitors. J Med Chem58:5121-36 (2015) 
 
Serine/threonine-protein kinase PAK 4
Name:Serine/threonine-protein kinase PAK 4
Type:Protein
Mol. Mass.:64098.01
Organism:Homo sapiens (Human)
Description:O96013
Residue:591
BDBM50097137
NameBDBM50097137
Synonyms:CHEMBL3580971
TypeSmall organic molecule
Emp. Form.C19H20N8
Mol. Mass.360.4157
SMILESCn1cnc2ccc(CNc3nccc(Nc4cc([nH]n4)C4CC4)n3)cc12