Reaction Details
TargetSerine/threonine-protein kinase PAK 1
LigandBDBM50097141
Substrate/Competitorn/a
Meas. Tech.ChEMBL_1499557 (CHEMBL3584415)
Ki 1470±n/a nM
Citation Crawford, JJLee, WAliagas, IMathieu, SHoeflich, KPZhou, WWang, WRouge, LMurray, LLa, HLiu, NFan, PWCheong, JHeise, CERamaswamy, SMintzer, RLiu, YChao, QRudolph, J Structure-Guided Design of Group I Selective p21-Activated Kinase Inhibitors. J Med Chem58:5121-36 (2015) 
 
Serine/threonine-protein kinase PAK 1
Name:Serine/threonine-protein kinase PAK 1
Type:n/a
Mol. Mass.:60640.15
Organism:Homo sapiens (Human)
Description:Q13153
Residue:545
BDBM50097141
NameBDBM50097141
Synonyms:CHEMBL3580966
TypeSmall organic molecule
Emp. Form.C18H22N8
Mol. Mass.350.4209
SMILESCN(C)c1ccc(CNc2nccc(Nc3cc([nH]n3)C3CC3)n2)cn1