Reaction Details
TargetSerine/threonine-protein kinase PAK 1
LigandBDBM50097132
Substrate/Competitorn/a
Meas. Tech.ChEMBL_1499557 (CHEMBL3584415)
Ki 26±n/a nM
Citation Crawford, JJLee, WAliagas, IMathieu, SHoeflich, KPZhou, WWang, WRouge, LMurray, LLa, HLiu, NFan, PWCheong, JHeise, CERamaswamy, SMintzer, RLiu, YChao, QRudolph, J Structure-Guided Design of Group I Selective p21-Activated Kinase Inhibitors. J Med Chem58:5121-36 (2015) 
 
Serine/threonine-protein kinase PAK 1
Name:Serine/threonine-protein kinase PAK 1
Type:n/a
Mol. Mass.:60640.15
Organism:Homo sapiens (Human)
Description:Q13153
Residue:545
BDBM50097132
NameBDBM50097132
Synonyms:CHEMBL3580962
TypeSmall organic molecule
Emp. Form.C17H25N7
Mol. Mass.327.4273
SMILESN[C@H]1CC[C@H](CNc2nccc(Nc3cc([nH]n3)C3CC3)n2)CC1