Reaction Details
TargetcAMP-dependent protein kinase catalytic subunit alpha
LigandBDBM50097152
Substrate/Competitorn/a
Meas. Tech.ChEMBL_1499749 (CHEMBL3585198)
Ki 140±n/a nM
Citation Green, JCao, JBandarage, UKGao, HCourt, JMarhefka, CJacobs, MTaslimi, PNewsome, DNakayama, TShah, SRodems, S Design, Synthesis, and Structure-Activity Relationships of Pyridine-Based Rho Kinase (ROCK) Inhibitors. J Med Chem58:5028-37 (2015) 
 
cAMP-dependent protein kinase catalytic subunit alpha
Name:cAMP-dependent protein kinase catalytic subunit alpha
Type:Enzyme Catalytic Subunit
Mol. Mass.:40598.73
Organism:Homo sapiens (Human)
Description:n/a
Residue:351
BDBM50097152
NameBDBM50097152
Synonyms:CHEMBL3581149
TypeSmall organic molecule
Emp. Form.C18H17N3O2S
Mol. Mass.339.411
SMILESCOc1cccc(CC(=O)Nc2cc(cs2)-c2ccnc(N)c2)c1