Reaction Details
TargetCytochrome P450 3A4
LigandBDBM50097160
Substrate/Competitorn/a
Meas. Tech.ChEMBL_1499751 (CHEMBL3585200)
IC50 11400±n/a nM
Citation Green, JCao, JBandarage, UKGao, HCourt, JMarhefka, CJacobs, MTaslimi, PNewsome, DNakayama, TShah, SRodems, S Design, Synthesis, and Structure-Activity Relationships of Pyridine-Based Rho Kinase (ROCK) Inhibitors. J Med Chem58:5028-37 (2015) 
 
Cytochrome P450 3A4
Name:Cytochrome P450 3A4
Type:Enzyme
Mol. Mass.:57349.57
Organism:Homo sapiens (Human)
Description:n/a
Residue:503
BDBM50097160
NameBDBM50097160
Synonyms:CHEMBL3581141
TypeSmall organic molecule
Emp. Form.C18H18N4O2S
Mol. Mass.354.426
SMILESCNc1cc(ccn1)-c1csc(NC(=O)Cc2cccc(OC)c2)n1