Reaction Details
TargetCytochrome P450 3A4
LigandBDBM50097161
Substrate/Competitorn/a
Meas. Tech.ChEMBL_1499751 (CHEMBL3585200)
IC50 3500±n/a nM
Citation Green, JCao, JBandarage, UKGao, HCourt, JMarhefka, CJacobs, MTaslimi, PNewsome, DNakayama, TShah, SRodems, S Design, Synthesis, and Structure-Activity Relationships of Pyridine-Based Rho Kinase (ROCK) Inhibitors. J Med Chem58:5028-37 (2015) 
 
Cytochrome P450 3A4
Name:Cytochrome P450 3A4
Type:Enzyme
Mol. Mass.:57349.57
Organism:Homo sapiens (Human)
Description:n/a
Residue:503
BDBM50097161
NameBDBM50097161
Synonyms:CHEMBL3581142
TypeSmall organic molecule
Emp. Form.C19H20N4O2S
Mol. Mass.368.453
SMILESCOc1cccc(CC(=O)Nc2nc(cs2)-c2ccnc(c2)N(C)C)c1