Reaction Details
TargetCytochrome P450 3A4
LigandBDBM50097166
Substrate/Competitorn/a
Meas. Tech.ChEMBL_1499751 (CHEMBL3585200)
IC50>30000±n/a nM
Citation Green, JCao, JBandarage, UKGao, HCourt, JMarhefka, CJacobs, MTaslimi, PNewsome, DNakayama, TShah, SRodems, S Design, Synthesis, and Structure-Activity Relationships of Pyridine-Based Rho Kinase (ROCK) Inhibitors. J Med Chem58:5028-37 (2015) 
 
Cytochrome P450 3A4
Name:Cytochrome P450 3A4
Type:Enzyme
Mol. Mass.:57349.57
Organism:Homo sapiens (Human)
Description:n/a
Residue:503
BDBM50097166
NameBDBM50097166
Synonyms:CHEMBL3580669
TypeSmall organic molecule
Emp. Form.C18H16FN3O3S2
Mol. Mass.405.466
SMILESCS(=O)(=O)Nc1cccc(CC(=O)Nc2cc(cs2)-c2ccnc(F)c2)c1