Reaction Details
TargetRho-associated protein kinase 1
LigandBDBM50097157
Substrate/Competitorn/a
Meas. Tech.ChEMBL_1499748 (CHEMBL3585197)
Ki 120±n/a nM
Citation Green, JCao, JBandarage, UKGao, HCourt, JMarhefka, CJacobs, MTaslimi, PNewsome, DNakayama, TShah, SRodems, S Design, Synthesis, and Structure-Activity Relationships of Pyridine-Based Rho Kinase (ROCK) Inhibitors. J Med Chem58:5028-37 (2015) 
 
Rho-associated protein kinase 1
Name:Rho-associated protein kinase 1
Type:Serine/threonine-protein kinase
Mol. Mass.:158156.77
Organism:Homo sapiens (Human)
Description:Q13464
Residue:1354
BDBM50097157
NameBDBM50097157
Synonyms:CHEMBL3581138
TypeSmall organic molecule
Emp. Form.C17H15N3O2S
Mol. Mass.325.385
SMILESCOc1cccc(CC(=O)Nc2cc(cs2)-c2ccncn2)c1