Reaction Details
TargetRho-associated protein kinase 1
LigandBDBM50097340
Substrate/Competitorn/a
Meas. Tech.ChEMBL_1499748 (CHEMBL3585197)
Ki 70±n/a nM
Citation Green, JCao, JBandarage, UKGao, HCourt, JMarhefka, CJacobs, MTaslimi, PNewsome, DNakayama, TShah, SRodems, S Design, Synthesis, and Structure-Activity Relationships of Pyridine-Based Rho Kinase (ROCK) Inhibitors. J Med Chem58:5028-37 (2015) 
 
Rho-associated protein kinase 1
Name:Rho-associated protein kinase 1
Type:Serine/threonine-protein kinase
Mol. Mass.:158156.77
Organism:Homo sapiens (Human)
Description:Q13464
Residue:1354
BDBM50097340
NameBDBM50097340
Synonyms:CHEMBL3581124
TypeSmall organic molecule
Emp. Form.C16H13N3O2S
Mol. Mass.311.358
SMILESOc1ccc(CC(=O)Nc2nc(cs2)-c2ccncc2)cc1