Reaction Details
TargetcAMP-dependent protein kinase catalytic subunit alpha
LigandBDBM50097356
Substrate/Competitorn/a
Meas. Tech.ChEMBL_1499749 (CHEMBL3585198)
Ki 2000±n/a nM
Citation Green, JCao, JBandarage, UKGao, HCourt, JMarhefka, CJacobs, MTaslimi, PNewsome, DNakayama, TShah, SRodems, S Design, Synthesis, and Structure-Activity Relationships of Pyridine-Based Rho Kinase (ROCK) Inhibitors. J Med Chem58:5028-37 (2015) 
 
cAMP-dependent protein kinase catalytic subunit alpha
Name:cAMP-dependent protein kinase catalytic subunit alpha
Type:Enzyme Catalytic Subunit
Mol. Mass.:40598.73
Organism:Homo sapiens (Human)
Description:n/a
Residue:351
BDBM50097356
NameBDBM50097356
Synonyms:CHEMBL3581118
TypeSmall organic molecule
Emp. Form.C16H12FN3OS
Mol. Mass.313.349
SMILESFc1cccc(CC(=O)Nc2nc(cs2)-c2ccncc2)c1