Reaction Details
TargetRho-associated protein kinase 1
LigandBDBM50097153
Substrate/Competitorn/a
Meas. Tech.ChEMBL_1499748 (CHEMBL3585197)
Ki 30±n/a nM
Citation Green, JCao, JBandarage, UKGao, HCourt, JMarhefka, CJacobs, MTaslimi, PNewsome, DNakayama, TShah, SRodems, S Design, Synthesis, and Structure-Activity Relationships of Pyridine-Based Rho Kinase (ROCK) Inhibitors. J Med Chem58:5028-37 (2015) 
 
Rho-associated protein kinase 1
Name:Rho-associated protein kinase 1
Type:Serine/threonine-protein kinase
Mol. Mass.:158156.77
Organism:Homo sapiens (Human)
Description:Q13464
Residue:1354
BDBM50097153
NameBDBM50097153
Synonyms:CHEMBL3581150
TypeSmall organic molecule
Emp. Form.C18H18N4O3S2
Mol. Mass.402.491
SMILESCS(=O)(=O)Nc1cccc(CC(=O)Nc2cc(cs2)-c2ccnc(N)c2)c1